
1. 项目概述从UART Lite看懂AXI总线到底在干什么你打开Vivado拖一个uart_lite IP进去勾选AXI4-Lite接口生成输出后发现顶层多了几十根信号线——axi_awaddr、axi_wdata、axi_arvalid、axi_rresp……密密麻麻像一捆理不清的耳机线。这时候很多人第一反应是“这不就是个串口IP吗怎么比接个杜邦线还复杂”其实AXI不是给UART加戏而是给整个系统装上了“交通指挥中心”。它不处理数据内容只管数据怎么走、谁先走、走多快、走对没——就像机场的塔台不管飞机运的是海鲜还是芯片只负责调度起降时序、分配跑道、确认指令无误。AXIAdvanced eXtensible Interface是ARM提出的片上总线协议标准核心目标就一个让不同速度、不同功能、不同厂商设计的模块能在一个FPGA或SoC里“说同一种话”。uart_lite本身是个轻量级串口控制器它内部只有几个寄存器比如RBR接收缓冲、THR发送保持、LSR线路状态但这些寄存器不能直接暴露给CPU去读写——因为CPU可能跑在200MHz而UART波特率才115200bpsCPU一次读32位UART寄存器却只占8位更关键的是CPU发来读请求时UART可能正在收数据状态还没准备好。AXI总线就是那个“翻译协调守门员”它把CPU的抽象读写操作转化成uart_lite能理解的时序信号并严格按协议握手确保每一步都稳。这个项目标题里的“基于uart_lite IP核”恰恰是最理想的入门切口。它结构极简仅支持AXI4-Lite子集无突发传输、无ID通道、无QoS信号数量少典型AXI4-Lite主从接口仅10~12根线行为确定所有操作都是单拍完成且Vivado自带例程完整、仿真波形清晰。我带过不少刚接触Zynq或MicroBlaze的开发者让他们先啃AXI-Stream或AXI-Full三天后基本放弃但用uart_lite搭一个AXI寄存器访问通路两小时就能看到LED随写入值变化——这种即时反馈是建立总线直觉最有效的催化剂。它不教你如何设计一个总线控制器而是让你亲手摸到总线的“脉搏”地址怎么译码、写数据何时采样、读响应怎么回传、等待状态怎么插入。这些细节在AXI协议文档第B章里用上百页讲清楚但真正让你记住的永远是你在SignalTap里抓到的那一个axi_rvalid拉高时刻。2. AXI总线设计逻辑与uart_lite适配原理2.1 为什么AXI要拆成5个独立通道这不是增加复杂度吗初学者看到AXI把读地址、读数据、写地址、写数据、写响应分成五组信号第一反应往往是“太啰嗦”。但这是经过大量SoC实践验证的解耦设计。我们拿快递收发来类比写地址通道AW相当于你填的快递单“收件地址”告诉系统“我要往哪个寄存器写”写数据通道W相当于你打包好的货物里面是实际要写入的8位/32位数据写响应通道B相当于快递员签收后给你的回执单说“已妥投”读地址通道AR相当于你打电话问“我的快递到哪了”指定要查哪个寄存器读数据通道R相当于快递员把包裹寄存器当前值送到你手上。这五个通道完全独立运行互不阻塞。比如CPU可以连续发10个写地址AW再批量发10个写数据W中间不用等响应B回来——这叫“地址/数据解耦”极大提升总线吞吐。uart_lite作为从设备内部没有缓存队列所以它必须严格遵守“收到AW和W后立刻执行写操作然后发B响应”而读操作中它收到AR后需根据当前UART状态如RBR是否满决定是否立即给出R数据否则就拉低rready表示“请稍等”。这种“按需响应”的弹性正是AXI区别于传统APB/AHB的核心优势它不强制要求从设备实时响应而是用valid/ready握手机制让慢速外设也能优雅接入高速总线。提示AXI4-Lite之所以“Lite”就在于它砍掉了AXI4-Full里最复杂的部分——突发传输burst、ID通道用于乱序响应匹配、用户自定义通道user channel。uart_lite只需要处理单个寄存器的读写根本用不到突发所以Vivado生成的IP默认只启用Lite模式信号精简到极致awaddr/awvalid/awready、wdata/wstrb/wvalid/wready、bresp/bvalid/bready、araddr/arvalid/arready、rdata/rresp/rvalid/rready——共12根线全部可在一个时钟周期内完成事务。2.2 uart_lite的寄存器映射与AXI地址空间如何对齐uart_lite IP核内部有6个核心寄存器按8位宽度排列地址偏移如下以基地址0x40600000为例寄存器名偏移地址功能说明访问类型RBR/THR0x00接收缓冲/发送保持同一地址读写不同功能R/WIER0x01中断使能寄存器R/WIIR0x02中断识别寄存器RLCR0x03线路控制寄存器R/WMCR0x04Modem控制寄存器R/WLSR0x05线路状态寄存器RAXI总线访问时CPU发出的32位地址如0x40600003会被uart_lite的地址译码模块截取低8位0x03再通过组合逻辑判断是否落在0x00~0x05范围内。这里有个关键细节AXI协议规定写操作时wstrb字节使能信号会精确指示哪些字节有效。比如CPU向0x40600003写一个32位值0x12345678但uart_lite只接受8位数据此时wstrb[3:0] 4b0001仅bit0有效硬件会自动提取data[7:0]0x78写入LCR。如果wstrb4b1111uart_lite会忽略高位仍只取低8位——这是AXI兼容窄宽设备的底层保障。注意Vivado中配置uart_lite时“Base Address”设置的是整个IP的起始地址而“Address Range”决定了该IP在总线上占据多少空间。对于uart_liteRange设为4KB足够0x40600000~0x40600FFF因为实际只用前6字节。但若后续添加其他IP必须确保地址不重叠否则会出现“写A地址却改了B寄存器”的灾难性错误。我曾见过某项目因地址分配疏忽导致修改UART的LCR时意外触发了GPIO中断调试三天才发现是地址译码逻辑把0x03和0x103映射到了同一块。2.3 AXI时序中的“等待状态”如何影响uart_lite行为AXI协议允许从设备在ready信号未拉高时插入等待周期waitstate这是应对慢速外设的关键机制。uart_lite在两种典型场景下会主动拉低ready读操作中LSR.RDR接收数据就绪为0当CPU读RBR0x00时若UART尚未收到新字节LSR[0] 0此时uart_lite会保持rready 0直到下一个字符到达并置位RDR才拉高rready并输出rdata写操作中LSR.THE发送保持器空为0当CPU向THR0x00写数据时若发送器正忙THE0uart_lite会保持wready 0直到硬件将前一字节移出移位器腾出空间后再接受新数据。这种“背压”机制让AXI总线天然支持异步时序。假设CPU工作在100MHzuart_lite内部逻辑跑在50MHz只要双方在各自时钟域正确同步valid/ready信号通常用两级触发器打拍就能稳定通信。我在实测中故意将uart_lite时钟降到1MHzCPU仍能正常读写寄存器只是每次读RBR可能等待上百个周期——总线不会崩溃只是变慢这正是AXI“健壮性”的体现。3. 实操全流程从Vivado创建到SignalTap抓波形验证3.1 Vivado工程搭建与IP集成关键步骤第一步不是写代码而是规划地址空间。新建Vivado工程后选择“Create Block Design”右键空白处选择“Add IP”搜索“axi_uartlite”双击添加。此时重点检查三个配置项Enable Interrupt Output勾选否则无法使用中断驱动后续扩展必备Use AXI4-Lite Interface必须勾选这是本项目基础Base Address点击右侧“Assign Address”在Address Editor中手动输入起始地址如0x40600000切勿用Auto Assign——自动分配可能与其他IP冲突且不利于后续软件开发。添加完成后右键Block Design选择“Validate Design”Vivado会检查连接合法性。此时你会看到uartlite_0模块引出了axi_*系列信号但尚未连接。接下来需要添加一个AXI Interconnect用于多主设备场景或直接连到PS端Zynq/MicroBlazeFPGA。以Zynq为例展开ZYNQ7 Processing System双击进入配置界面在“Peripheral I/O Pins”页签下找到“UART 1”并禁用避免与PL侧uart_lite冲突然后在“AXI Non Secure Enable”中勾选“S_AXI_GP0”最后点击“Run Connection Automation”Vivado会自动将uartlite_0的axi_*信号连到GP0接口。实操心得很多新手卡在“Validate Design失败”常见原因是忘记为AXI Interconnect配置地址范围。正确做法是添加AXI Interconnect后双击其属性在“Address Mapping”中为每个Slave Port手动设置Base Address和Range如uartlite_0设为0x40600000Range4KB否则Vivado无法生成地址译码逻辑综合会报错“address not assigned”。3.2 地址译码与寄存器访问的Verilog实现要点虽然Vivado自动生成uart_lite RTL代码但理解其内部译码逻辑对调试至关重要。以下是简化版地址译码核心代码基于uart_lite_v2_0的参考实现// 假设axi_awaddr[11:0]为12位地址线基地址0x40600000对应offset[11:0]0 wire [5:0] addr_offset axi_awaddr[5:0]; // 只需低6位因寄存器仅0x00~0x05 wire is_uart_addr (addr_offset 6h05); // 判断地址是否在uart-lite有效范围内 // 写地址通道译码 always (posedge aclk) begin if (aresetn 1b0) begin aw_ready_reg 1b0; end else if (aw_valid is_uart_addr) begin aw_ready_reg 1b1; // 地址有效则立即响应 end else begin aw_ready_reg 1b0; end end // 写数据采样关键必须在aw_ready w_valid同时为高时锁存 always (posedge aclk) begin if (aresetn 1b0) begin reg_data 8h00; end else if (aw_ready_reg w_valid wstrb[0]) begin // 仅bit0使能时采样 reg_data wdata[7:0]; end end这段代码揭示了两个硬核细节地址比较必须在aw_valid有效期间进行AXI协议规定awaddr只在aw_valid为高时才稳定所以译码逻辑必须用aw_valid作为使能条件否则可能采样到地址跳变过程中的毛刺写数据采样需同时满足aw_ready和w_valid因为aw_ready拉高表示从设备已接收地址此时w_valid才代表数据有效。如果只用w_valid触发可能在地址未确认前就锁存错误数据。3.3 SDK中C语言驱动编写与内存映射验证在Vivado导出硬件后启动SDK创建Application Project。关键步骤是获取uart_lite的物理地址并映射到虚拟内存#include xparameters.h #include xil_io.h #define UARTLITE_BASEADDR XPAR_AXI_UARTLITE_0_BASEADDR #define RBR_OFFSET 0x00 #define THR_OFFSET 0x00 #define LSR_OFFSET 0x05 int main() { u32 base UARTLITE_BASEADDR; u32 lsr_val; // 检查LSR寄存器是否可读验证AXI通路 lsr_val Xil_In32(base LSR_OFFSET); xil_printf(LSR value: 0x%02x\r\n, lsr_val 0xFF); // 向THR写入字符AASCII 0x41 Xil_Out32(base THR_OFFSET, 0x41); return 0; }编译下载后用串口助手连接应看到字符A被发出。若Xil_In32返回全0或异常值说明AXI访问失败需检查硬件中是否启用了正确的时钟uart_lite必须有时钟输入且频率需满足波特率计算地址宏XPAR_AXI_UARTLITE_0_BASEADDR是否与Vivado中设置一致Zynq PS端是否已使能S_AXI_GP0接口在Zynq配置中勾选“S_AXI_GP0”。实操心得我曾遇到一个经典问题——程序能读LSR但写THR无效。抓波形发现wvalid一直为高但wready始终为低。排查发现是uart_lite的aclk时钟未连接Vivado Block Design中uartlite_0的s_axi_aclk引脚悬空导致内部逻辑无法运行自然不会拉高wready。解决方法右键uartlite_0 → “Connect Board Component”选择正确的时钟源如fabric_clk_0。3.4 SignalTap逻辑分析仪抓取AXI事务全过程这是理解AXI本质最直观的方式。在Vivado中打开SignalTap添加以下信号axi_awaddr[5:0],axi_awvalid,axi_awready写地址通道axi_wdata[31:0],axi_wstrb[3:0],axi_wvalid,axi_wready写数据通道axi_bresp[1:0],axi_bvalid,axi_bready写响应通道设置触发条件为axi_awvalid axi_awaddr6h00写RBR/THR地址捕获波形如下Time: 0ns awvalid1, awaddr0x00 → awready1地址被接受 Time: 10ns wvalid1, wdata0x00000041, wstrb4b0001 → wready1数据被采样 Time: 20ns bvalid1, bresp2b00OKAY→ bready1响应被接收注意观察时序关系awready必须在awvalid之后至少1个周期内拉高否则主设备超时wready必须在wvalid之后拉高否则数据丢失bready必须在bvalid之后拉高否则响应丢弃。这三个握手周期的严格约束构成了AXI可靠性的基石。当你在SignalTap里亲眼看到awvalid和awready同时为高表示地址握手完成再看到wvalid和wready同时为高表示数据握手完成那种“原来如此”的顿悟感远胜读十页协议文档。4. 常见问题深度排查与避坑指南4.1 AXI总线“假死”现象awvalid一直为高awready始终为低现象描述CPU发起写操作后SignalTap显示axi_awvalid持续为高但axi_awready始终为低后续wvalid、bvalid均无动作系统卡死。根本原因uart_lite的复位信号aresetn未正确释放。AXI协议规定从设备在aresetn为低时必须将所有ready信号置为0且不响应任何valid请求。如果硬件中aresetn连接了全局复位但复位释放时间过短100ns或复位信号存在毛刺uart_lite内部状态机可能停留在复位态导致awready永不出。排查步骤在SignalTap中添加aresetn信号确认其是否在系统启动后稳定为高检查Vivado中uart_lite的aresetn是否连接到正确的复位网络如proc_sys_reset的peripheral_aresetn若使用自定义复位逻辑确保复位脉冲宽度≥2个aclk周期Vivado综合报告中可查aclk频率。解决方案在Block Design中添加“proc_sys_reset”IP将其“Peripheral A Reset”输出连接到uartlite_0的aresetn并在Zynq配置中启用“Use Internal Reset Logic”。这样复位由PS端统一管理可靠性远高于手工布线。4.2 读操作返回全0rvalid有脉冲但rdata恒为0现象描述CPU读RBR0x00时SignalTap显示axi_arvalid、axi_arready握手成功axi_rvalid有脉冲但axi_rdata始终为0x00000000无论UART是否收到数据。根本原因地址译码逻辑错误将读请求误导向了未初始化的寄存器。uart_lite内部RBR寄存器实际存储在rx_fifo中但读操作需通过状态机将rx_fifo数据转移到rdata输出寄存器。如果地址译码将0x00映射到了错误的分支如指向了一个未赋值的wirerdata就会输出默认值0。排查步骤查看uart_lite生成的RTL代码位于project.srcs/sources_1/ip/uartlite_0/uartlite_v2_0/sim/uartlite_v2_0.v定位rdata赋值语句检查case(addr_offset)分支中6h00是否正确指向rdata rx_data;rx_data为接收FIFO输出在SignalTap中添加内部信号rx_data和addr_offset确认当addr_offset0时rx_data是否为预期值。解决方案重新生成uart_lite IP勾选“Debug Ports”选项Vivado会暴露内部寄存器信号供SignalTap观测。或者在Verilog中添加显式赋值assign rdata (addr_offset 6h00) ? rx_data : 32h0;强制覆盖默认值。4.3 中断无法触发axi_intr引脚无输出现象描述配置好中断后CPU未收到中断请求axi_intr信号始终为高active-low。根本原因中断使能寄存器IER未正确配置。uart_lite的IER bit0控制RBR中断接收数据就绪bit1控制THRE中断发送保持器空。若软件未向IER写入0x01则即使RBR收到数据也不会拉低axi_intr。排查步骤在SignalTap中添加ier_regIER寄存器值和intr_pending中断挂起标志运行程序后用Xil_Out32(base IER_OFFSET, 0x01)写IER观察ier_reg是否变为0x01若ier_reg正确但intr_pending不置位检查rx_fifo_full信号是否正常需确认UART时钟和波特率配置正确。避坑技巧在SDK中初始化UART时务必按顺序操作Xil_Out32(base IER_OFFSET, 0x00); // 先清零IER避免残留使能 Xil_Out32(base LCR_OFFSET, 0x80); // 写LCR[7]1进入DLL/DLM模式 Xil_Out32(base 0x00, 0x0C); // 写DLL0x0C对应9600bps Xil_Out32(base 0x01, 0x00); // 写DLM0x00 Xil_Out32(base LCR_OFFSET, 0x03); // 写LCR[1:0]0b118位数据 Xil_Out32(base IER_OFFSET, 0x01); // 最后使能RBR中断4.4 多IP地址冲突写A地址却修改了B寄存器现象描述向uart_lite的0x40600000写数据结果GPIO IP的输出寄存器被意外修改。根本原因Vivado Address Editor中两个IP的地址范围重叠。例如uart_lite设为0x40600000~0x40600FFFGPIO设为0x40600000~0x40600FFF那么地址0x40600000同时命中两个设备AXI Interconnect会将请求广播给所有匹配设备。排查步骤在Vivado中打开Address EditorTools → Address Editor查看每个IP的“Base Address”和“Range”检查是否有两个IP的地址区间存在交集如IP1: 0x40600000~0x40600FFFIP2: 0x40600800~0x40600FFF在SignalTap中添加AXI Interconnect的s00_axi_awaddr和各slave的awaddr确认请求是否被错误路由。解决方案严格遵循“非重叠、留余量”原则分配地址。例如uart_lite0x40600000 ~ 0x40600FFF4KBGPIO0x40601000 ~ 0x40601FFF4KBSPI0x40602000 ~ 0x40602FFF4KB并在Address Editor中为每个IP单独点击“Set Address”按钮确保Vivado生成正确的译码逻辑。5. AXI总线能力边界与uart_lite的局限性突破5.1 uart_lite为何无法支持AXI4-Full它的性能天花板在哪AXI4-Full支持突发传输burst即一次地址请求后可连续传输多个数据如INCR突发地址自动递增。但uart_lite的寄存器是离散的、功能各异的RBR读、THR写、LSR只读根本不支持地址递增访问。比如向0x40600000发起4-beat INCR突发硬件会尝试访问0x40600000、0x40600004、0x40600008、0x4060000C但uart_lite的0x04是MCR0x08超出寄存器范围必然导致不可预知行为。因此Vivado在生成uart_lite时强制将其限定在AXI4-Lite模式禁用所有burst相关信号如awlen、arsize。性能方面uart_lite的理论极限由其内部时钟和握手延迟决定。假设aclk100MHz10ns周期一次完整写事务需awvalid→awready1周期、wvalid→wready1周期、bvalid→bready1周期共30ns。即最大写吞吐为33MB/s100MHz/3但这只是理论值——实际受限于UART波特率。例如115200bps的UART每秒最多收发约14.4KB数据AXI总线再快也无意义。所以uart_lite的瓶颈从来不在AXI而在UART物理层。5.2 当你需要更高带宽时AXI-Stream才是UART的“真·搭档”如果项目需求从“配置寄存器”升级为“高速数据流传输”如视频采集、ADC采样uart_lite立刻捉襟见肘。此时应切换到AXI-Stream协议。AXI-Stream专为数据流设计只有tdata/tvalid/tready三根核心信号无地址概念天然支持流水线。Xilinx提供的axi_uart16550IP非lite版就同时支持AXI4-Lite寄存器配置和AXI-Stream数据收发双接口Lite接口用于设置波特率、中断使能Stream接口则以DMA方式搬运收发数据CPU完全不参与字节搬运效率提升百倍。实操中我曾用axi_uart16550 AXI DMA构建了一个1Mbps UART透传系统PS端配置好DMA后PL侧UART收到的数据自动存入DDR无需CPU干预反之DDR中的数据也可由DMA推送给UART发送。整个过程在SignalTap中看到的是tvalid持续为高、tready几乎不拉低的“满速流”这才是AXI协议在真实场景中的威力体现。5.3 从uart_lite出发延伸学习AXI生态的实用路径掌握uart_lite只是起点AXI真正的价值在于其生态互通性。建议按此路径进阶横向扩展用相同方法集成axi_gpio、axi_timer对比它们的寄存器映射和AXI交互差异理解“AXI从设备通用模型”纵向深入阅读ARM AMBA AXI Protocol Specification文档第B章重点研究AWLOCK/ARLOCK锁定事务、AWCACHE/ARCACHE缓存属性等高级特性为后续接入Cache一致性系统打基础实战迁移将uart_lite替换为axi_iicI2C控制器你会发现AXI接口代码几乎不变只是寄存器定义和功能逻辑不同——这正是AXI“标准化”的红利学会一种通吃所有AXI外设。我个人在实际项目中最大的体会是AXI总线本身并不难难的是建立“时序直觉”。当你能在SignalTap里一眼看出awvalid和awready的相位关系能预判wready在第几个周期拉高能从rresp2b10SLVERR快速定位到地址译码错误你就真正跨过了那道门槛。而uart_lite就是那把最趁手的入门刻刀——它足够简单让你看清每一根信号的来龙去脉又足够真实让你触摸到工业级总线的温度与脉搏。