APB总线SM4协处理器:可综合硬件IP与寄存器级握手设计

发布时间:2026/10/28 20:12:03
APB总线SM4协处理器:可综合硬件IP与寄存器级握手设计 简介本资源是一份面向数字电路与密码硬件设计初学者及FPGA开发者的Verilog实践项目聚焦于SM4国密算法在嵌入式总线架构中的协处理器实现。资源提供完整APB总线兼容的SM4协处理器设计方案涵盖APB从机接口模块apb_slave、顶层集成模块top_level及SM4核心算法模块SM4支持明文/密钥分四次写入、加密触发与128位密文读取代码结构清晰、寄存器定义规范、复位与时序逻辑严谨便于理解总线交互与密码IP核集成方法。压缩包为单个37KB的docx文档内含全部Verilog源码含注释、模块接口说明及SM4算法原理简述适合作为课程设计参考、FPGA密码实验范例或IP核二次开发基础。目前已有524人学习下载内容精炼实用可直接用于仿真验证与板级移植。1. 基于APB总线的SM4密码协处理器不是“跑个例程就完事”的IP核而是能直接挂进SoC总线、支持寄存器级控制、带完整握手时序的可综合硬件模块你手头有个FPGA项目主控是ARM Cortex-M系列或RISC-V软核系统里已经跑着AMBA APB总线——这时候突然要加国密算法支持不是去GitHub找段C代码编译进去就完事。你需要的是一个真正能塞进APB地址空间、用标准读写周期触发加密、不依赖CPU轮询、结果可按字节/字对齐读出的硬件协处理器。这个资源就是干这个的它把SM4-128全轮迭代32轮非线性变换密钥扩展全部用同步时序电路实现APB从机接口严格遵循PSELx/PENABLE/PWRITE/PADDR四信号协议明文和密钥分8次32位写入对应0x00~0x1c共8个地址加密完成自动置位ready_out读取时按0x00/0x04/0x08/0x0c顺序取出密文低32~高32位。它不是教学Demo不是行为级仿真模型而是一个经过testbench全路径验证、寄存器定义与主流APB规范对齐、关键路径已做时序约束提示的可落地IP。适合正在做安全芯片原型、国产化SoC集成、或需要在资源受限MCU系统中卸载SM4计算负载的硬件工程师——尤其当你发现软件实现SM4在100MHz主频下要耗掉30%以上CPU时间时这个Verilog包就是你的后悔药。2. APB从机接口设计为什么用PSELxPENABLE双信号判别传输阶段而不是只看PWRITE电平2.1 APB协议核心时序逻辑PSELx选中 PENABLE使能 有效传输窗口APB总线采用两级握手机制PSELx在地址相位第一个时钟上升沿拉高表示当前设备被选中PENABLE在数据相位第二个时钟上升沿拉高才表示本次读/写操作真正生效。这种设计隔离了地址建立与数据采样避免毛刺干扰。本设计中always (posedge PCLK or negedge PRESETN)块内判断条件if(PSELx PENABLE PWRITE)正是抓住这个黄金窗口——只有当片选有效、使能有效、且写信号为高时才将PWDATA锁存进对应地址的寄存器。若错误地仅用if(PSELx PWRITE)则会在地址相位PENABLE0时误锁存数据导致寄存器值错乱。// ✅ 正确严格匹配APB传输周期 always (posedge PCLK or negedge PRESETN) begin if (!PRESETN) begin data1 32h0; // ... 其他寄存器复位 end else if (PSELx PENABLE PWRITE) begin // ← 关键PSELx AND PENABLE AND PWRITE case (PADDR[7:0]) 8h00: data1 PWDATA; // 明文第0字低32位 8h04: data2 PWDATA; // 明文第1字 8h08: data3 PWDATA; // 明文第2字 8h0c: begin data4 PWDATA; text_isvalid_in 1b1; // 明文写满4字置有效标志 end 8h10: key1 PWDATA; // 密钥第0字 8h14: key2 PWDATA; // 密钥第1字 8h18: key3 PWDATA; // 密钥第2字 8h1c: begin key4 PWDATA; mk_isvalid_in 1b1; // 密钥写满4字置有效标志 end endcase end else if (PSELx PENABLE !PWRITE) begin // ← 读操作同样需PENABLE case (PADDR[7:0]) 8h0c: prdata DATA_ENC[31:0]; // 读密文最高32位地址0x0c 8h08: prdata DATA_ENC[63:32]; // 读次高32位地址0x08 8h04: prdata DATA_ENC[95:64]; // 读次低32位地址0x04 8h00: prdata DATA_ENC[127:96]; // 读最低32位地址0x00 default: prdata 32h0; endcase end end参数说明PADDR[7:0]截取低8位作为寄存器偏移符合APB从机地址解码惯例8h00~0x1c共8个地址每4字节一个寄存器覆盖128位明文4×32和128位密钥4×32text_isvalid_in和mk_isvalid_in是关键握手信号由APB写操作末尾自动置位驱动SM4模块启动。2.2 地址映射与寄存器布局为什么明文/密钥各占4个独立地址而非连续数组虽然SM4明文和密钥都是128位但本设计未使用reg [127:0] data_reg单寄存器存储而是拆成data1/data2/data3/data4四个32位寄存器。原因有三APB总线天然按字对齐标准APB传输宽度为32位一次只能写入/读出32位数据强行用128位宽寄存器需额外地址译码逻辑便于调试与分步加载实际应用中密钥可能来自OTP或外部安全模块分4次写入更易控制时序规避综合工具对宽寄存器的优化陷阱某些综合器对64位寄存器会插入不必要的锁存器拆分后时序收敛更稳定。地址偏移寄存器名功能写入时机读取时机0x00data1明文低32位第1次写操作读密文最高32位DATA_ENC[127:96]0x04data2明文次低32位第2次写操作读密文次高32位DATA_ENC[95:64]0x08data3明文次高32位第3次写操作读密文次低32位DATA_ENC[63:32]0x0cdata4明文高32位第4次写操作读密文最低32位DATA_ENC[31:0]0x10key1密钥低32位第5次写操作—0x14key2密钥次低32位第6次写操作—0x18key3密钥次高32位第7次写操作—0x1ckey4密钥高32位第8次写操作—2.3 复位与异步处理PRESETN低电平有效为何必须用negedge PRESETNPRESETN是全局异步复位信号低电平有效。在always (posedge PCLK or negedge PRESETN)块中negedge PRESETN确保复位动作在时钟无关的任意时刻生效这是FPGA设计铁律。若错误写成always (posedge PCLK or posedge PRESETN)则复位需等待时钟上升沿可能导致上电瞬间寄存器处于亚稳态。本设计中复位逻辑明确清零所有数据寄存器、密钥寄存器及输出prdata并初始化text_isvalid_in和mk_isvalid_in为1b0无效状态防止上电即触发加密。// ✅ 正确异步复位立即生效 always (posedge PCLK or negedge PRESETN) begin if (!PRESETN) begin // ← PRESETN为低时进入复位 data1 32h0; data2 32h0; data3 32h0; data4 32h0; key1 32h0; key2 32h0; key3 32h0; key4 32h0; prdata 32h0; text_isvalid_in 1b0; // 复位后明文无效 mk_isvalid_in 1b0; // 复位后密钥无效 end else begin // ... 正常操作逻辑 end end注意PRESETN必须连接到FPGA的专用全局复位引脚如Xilinx的GSR不可用普通IO模拟否则无法保证全芯片寄存器同步复位。3. SM4算法硬件化32轮迭代如何用6位计数器组合逻辑实现而非循环语句3.1 轮函数F(X0,X1,X2,X3,rk)的硬件展开为什么不用for循环而用cnt索引Verilog中for循环在综合时会被展开为并行逻辑但32轮迭代若直接写for(i0;i32;i)会导致逻辑爆炸。本设计采用状态机计数器驱动方式用6位计数器cnt0~31标记当前轮次每拍执行一轮运算X[cnt4] X[cnt] ^ T(X[cnt1]^X[cnt2]^X[cnt3]^rk[cnt])。关键在于T()函数的硬件实现——先查Sbox表4个8位并行查表再执行线性变换L()位移异或组合。这种结构将32轮压缩为单周期流水面积开销可控。// ✅ 正确用计数器驱动轮迭代避免循环展开 always (posedge clk_i or negedge rst_n_i) begin if (~rst_n_i) begin {X[0],X[1],X[2],X[3]} 0; end else begin if (text_isvalid_in) // ← 仅在明文有效时加载初始X[0..3] {X[0],X[1],X[2],X[3]} text_i; if (ready_out 0) begin // ← ready_out0表示加密进行中 // 轮函数核心F(X0,X1,X2,X3,rk) X0 ^ T(X1^X2^X3^rk) {b0,b1,b2,b3} X[cnt1] ^ X[cnt2] ^ X[cnt3] ^ rk[cnt]; A {Sbox[b0], Sbox[b1], Sbox[b2], Sbox[b3]}; // 并行查4个Sbox // L(A) A ^ (A2) ^ (A10) ^ (A18) ^ (A24) X[cnt4] X[cnt] ^ A[31:0] ^ ({A[29:0], A[31:30]}) // A2 ^ ({A[21:0], A[31:22]}) // A10 ^ ({A[13:0], A[31:14]}) // A18 ^ ({A[ 7:0], A[31: 8]}); // A24 end if (carry 1b1) begin // ← carry1表示32轮完成 dat_o {X[35], X[34], X[33], X[32]}; // 输出最终密文 end end end逻辑说明cnt从0计数到31每拍计算X[cnt4]最终X[32..35]即为密文carry由cnt6d31产生作为完成标志Sbox是预定义的256项ROM{Sbox[b0],...}实现4字节并行查表比串行查表快4倍。3.2 Sbox与CK常量ROM为什么用always (posedge clk_i)初始化而非initialinitial块仅在仿真中执行无法综合进FPGA。本设计将Sbox和CK常量写入always (posedge clk_i)块利用FPGA Block RAM资源实现只读存储。Sbox[0]8hd6等语句在综合时被映射为BRAM初始化值确保上电即加载。CK数组32项对应32轮常量FK数组4项密钥扩展初始异或值全部硬编码无外部配置开销。// ✅ 正确用时序逻辑初始化ROM可综合 always (posedge clk_i) begin CK[0] 32h00070e15; CK[1] 32h1c232a31; // ... 共32项 Sbox[0] 8hd6; Sbox[1] 8h90; // ... 共256项0~255 FK[0] 32hA3B1BAC6; FK[1] 32h56AA3350; // ... 共4项 end参数说明CK[i]是SM4标准轮常量FK[i]是密钥扩展初始异或值均来自GM/T 0002-2012《SM4分组密码算法》附录Sbox是标准16×16置换表此处以8位向量形式展开避免多维数组综合问题。3.3 密钥扩展模块MK→K[0..35]→rk[0..31]的三级流水如何避免组合环路密钥扩展分两步先将输入密钥mk_i拆为MK0..MK3与FK[0..3]异或得K[0..3]再用K[i] ^ T(K[i1]^K[i2]^K[i3]^CK[i])递推生成K[4..35]其中K[4..35]即为32轮轮密钥rk[0..31]。关键点在于所有赋值均为同步时序K[cnt4]的计算依赖cnt当前值无组合反馈环。若错误地用assign K[4] K[0] ^ ...则形成组合环路综合失败。// ✅ 正确密钥扩展完全同步无组合环 always (posedge clk_i or negedge rst_n_i) begin if (~rst_n_i) begin {MK0,MK1,MK2,MK3} 0; end else begin if (mk_isvalid_in) begin // ← 仅在密钥有效时加载MK0..3 {MK0,MK1,MK2,MK3} mk_i; K[3] MK3 ^ FK[3]; // 初始化K[0..3] K[2] MK2 ^ FK[2]; K[1] MK1 ^ FK[1]; K[0] MK0 ^ FK[0]; end if (ready_out 0) begin // ← 加密进行中递推K[4..35] {a0,a1,a2,a3} K[cnt1] ^ K[cnt2] ^ K[cnt3] ^ CK[cnt]; B {Sbox[a0], Sbox[a1], Sbox[a2], Sbox[a3]}; // LN(B) B^(B13)^(B23) K[cnt4] K[cnt] ^ B[31:0] ^ ({B[18:0], B[31:19]}) // B13 ^ ({B[ 8:0], B[31: 9]}); // B23 rk[cnt] K[cnt4]; // rk[0..31] K[4..35] end end end避坑提示K[cnt4]的索引必须确保cnt4 ≤ 35故cnt范围为0~31与轮数严格对应K数组声明为reg [31:0] K [0:35]共36项满足索引需求。4. 验证与测试为什么testbench必须模拟APB完整时序而非直接驱动内部信号4.1 top_level_tb.v中的APB时序建模PSELx/PENABLE的40ns延时如何对应真实总线testbench中PSELx 1; PENABLE #40 1;并非随意设值而是模拟APB协议要求PSELx需在地址相位PCLK上升沿建立PENABLE在下一个PCLK上升沿即40ns后假设PCLK25MHz才有效。#40精确匹配25MHz时钟周期40ns确保仿真波形与真实FPGA时序一致。若省略此延时PENABLE与PSELx同时变高则违反APB时序导致apb_slave模块无法识别有效传输。// ✅ 正确严格建模APB时序 initial begin PADDR 8h00; PRESETN 0; #100 PRESETN 1; // 复位释放 // 写明文8次32位写入 repeat(8) begin PWDATA mem_word[i]; // 从测试内存读数据 PWRITE 1; // 写操作 PSELx 1; // 片选有效 PENABLE #40 1; // 40ns后使能地址相位→数据相位 #40 PSELx 0; // 使能后40ns撤选 PENABLE 0; #80; // 等待120ns3个周期再写下一个 PADDR PADDR 8h04; i i 4b1; end // 读密文4次32位读取 PADDR 8h00; i4b0000; #3500; // 等待加密完成32轮×约100ns/轮≈3200ns repeat(4) begin PWRITE 0; // 读操作 PSELx 1; PENABLE #40 1; #40 PSELx 0; PENABLE 0; #80; PADDR PADDR 8h04; end end参数说明#40对应25MHz时钟周期40ns#80为2个周期确保总线空闲#3500预留足够时间让32轮加密完成实测约3200ns避免读取未完成数据。4.2 测试向量选择为什么用0123456789ABCDEFFEDCBA9876543210而非随机数该测试向量是SM4标准测试用例来自GM/T 0002-2012附录B明文与密钥相同预期密文为681edf34d206965e86b3e94f536e4246。使用标准向量可交叉验证用本Verilog设计仿真对比prdata输出用OpenSSL命令openssl sm4 -e -K 0123456789ABCDEFFEDCBA9876543210 -iv 0000000000000000 -in plain.txt -out cipher.bin生成参考密文若两者一致则证明硬件实现正确。若用随机数无法定位是算法错误还是测试向量偏差。4.3 顶层模块top_level的作用为什么不能直接例化apb_slave而要加一层wrappertop_level是APB总线与SM4算法模块的胶合层承担三项关键职责信号整形将APB总线信号PSELx/PENABLE/PADDR/PWRITE转换为apb_slave所需格式跨时钟域桥接apb_slave与SM4_U共享PCLK但SM4_U的clk_i需明确连接top_level确保时钟扇出干净端口聚合将apb_slave的KEY/DATA_i与SM4_U的mk_i/text_i一一对应避免连线错误。若跳过top_level直接连apb_slave到SM4_U则PADDR等总线信号会暴露给算法模块破坏模块化设计原则。// ✅ 正确top_level作为标准APB从机封装 module top_level( input PSELx, input PENABLE, input [31:0] PADDR, input PWRITE, input PRESETN, input PCLK, input [31:0] PWDATA, output [31:0] prdata ); wire [127:0] KEY; wire [127:0] DATA_i; wire [127:0] SM4_DATA; wire text_isvalid_in; wire mk_isvalid_in; apb_slave s1 ( .PSELx(PSELx), .PENABLE(PENABLE), .PADDR(PADDR), .PWRITE(PWRITE), .PRESETN(PRESETN), .PCLK(PCLK), .PWDATA(PWDATA), .prdata(prdata), .SM4_DATA(SM4_DATA), .KEY(KEY), .DATA_i(DATA_i), .text_isvalid_in(text_isvalid_in), .mk_isvalid_in(mk_isvalid_in) ); SM4_U s2 ( .clk_i(PCLK), .rst_n_i(PRESETN), .mk_i(KEY), .text_i(DATA_i), .mk_isvalid_in(mk_isvalid_in), .text_isvalid_in(text_isvalid_in), .dat_o(SM4_DATA) ); endmodule注意top_level无任何逻辑仅为端口映射综合后零门电路但它是SoC集成的必备接口。5. 避坑 / 常见问题 / 排查APB-SM4协处理器上板必踩的5个坑5.1 现象仿真波形中prdata始终为0ready_out一直为0原因text_isvalid_in和mk_isvalid_in未正确置位。检查apb_slave中写操作地址是否匹配——明文最后写入地址必须是0x0c触发text_isvalid_in1密钥最后写入地址必须是0x1c触发mk_isvalid_in1。若写错地址如密钥写到0x18就停止则两个标志均为0SM4模块永不启动。解决用仿真波形查看PADDR和PWDATA确认8次写操作地址依次为0x00,0x04,0x08,0x0c,0x10,0x14,0x18,0x1c在apb_slave中添加$display(ADDR%h, DATA%h, PADDR, PWDATA);打印调试。5.2 现象加密结果与OpenSSL不一致但前几轮中间值相同原因Sbox查表索引错误。SM4标准Sbox是16×16表输入为8位0~255但代码中{Sbox[a0],Sbox[a1],Sbox[a2],Sbox[a3]}要求a0~a3为8位变量。若a0被误声明为reg [3:0]4位则查表时高位补0导致Sbox[0]被重复使用。解决检查apb_slave和SM4_U中所有Sbox索引变量声明必须为reg [7:0] a0,a1,a2,a3用$display(a0%h, a0);确认其值为8位如0x1a而非0x0a。5.3 现象FPGA上板后加密卡死ready_out永远为0原因cnt计数器未复位或溢出。cnt为6位寄存器0~63但SM4只需0~31。若cnt在ready_out1后未清零下次加密时从32开始计数K[cnt4]索引越界K[36]不存在导致X[cnt4]为未知态carry无法置位。解决在SM4_U的always (posedge clk_i or negedge rst_n_i)块中carry1后必须强制cnt0。原文代码缺失此步需手动添加if (carry 1b1) begin dat_o {X[35],X[34],X[33],X[32]}; cnt 6b0; // ← 关键修复重置计数器 end5.4 现象APB读操作返回数据错位如地址0x00读到密文高32位原因prdata赋值地址映射反了。apb_slave中case(PADDR[7:0])分支8h00: prdataDATA_ENC[127:96]对应密文最低32位但若误写为8h00: prdataDATA_ENC[31:0]则地址0x00返回最低32位与软件预期相反。解决严格对照SM4标准输出格式密文C C0||C1||C2||C3C0为最高32位C3为最低32位apb_slave中0x0c应返回C0DATA_ENC[127:96]0x00应返回C3DATA_ENC[31:0]。5.5 现象综合后资源占用超限LUT超100%原因Sbox和CK数组未用Block RAM实现。Sbox[0:255]若声明为reg [7:0] Sbox [0:255]综合器默认用分布式RAMLUT消耗大量LUT。解决将Sbox和CK改为(* ram_style block *)属性强制映射到Block RAM(* ram_style block *) reg [7:0] Sbox [0:255]; (* ram_style block *) reg [31:0] CK [0:31];并在综合约束文件中添加set_property RAM_STYLE {BLOCK} [get_cells -hier -filter {ref_nameSbox}]。6. 进阶技巧如何将此协处理器接入AXI总线以及32位密钥分发的实战优化6.1 APB转AXI桥接用Xilinx AXI Interconnect IP实现无缝对接实际SoC中主控多为AXI总线需APB转AXI桥。Xilinx Vivado提供axi_apb_bridgeIP核配置要点Data Width设为32位匹配APB从机Address Width设为16位支持64KB地址空间足够挂多个外设APB Slave Base Address在AXI地址映射中为SM4协处理器分配固定基址如0x43C0_0000Interrupt将SM4_U.ready_out接入AXI GPIO中断引脚实现加密完成中断通知。验证方法在Vivado中生成bitstream后用SDK编写C程序// 写明文地址0x43C00000 ~ 0x43C0000C Xil_Out32(0x43C00000, 0x01234567); Xil_Out32(0x43C00004, 0x89ABCDEF); Xil_Out32(0x43C00008, 0xFEDCBA98); Xil_Out32(0x43C0000C, 0x76543210); // 写密钥地址0x43C00010 ~ 0x43C0001C Xil_Out32(0x43C00010, 0x5323556D); Xil_Out32(0x43C00014, 0x89AB1DEF); Xil_Out32(0x43C00018, 0x3E2CBA9D); Xil_Out32(0x43C0001C, 0x76E43C10); // 轮询ready_out地址0x43C00000读回0x00000001表示完成 while((Xil_In32(0x43C00000) 0x1) 0); // 读密文 uint32_t c0 Xil_In32(0x43C0000C); // 高32位 uint32_t c1 Xil_In32(0x43C00008); // 次高32位6.2 密钥安全分发如何用OTP存储密钥并动态加载工业场景中密钥不可明文写入寄存器。方案OTP区域在FPGA配置比特流中预留OTP block烧录密钥哈希加载流程上电后CPU从OTP读取密钥密文用AES-128解密需额外AES IP再通过APB写入0x10~0x1c防重放在apb_slave中增加key_valid寄存器仅当key_valid1时才允许mk_isvalid_in置位避免非法写入。// 在apb_slave中添加密钥有效性锁 reg key_valid 1b0; always (posedge PCLK or negedge PRESETN) begin if (!PRESETN) key_valid 1b0; else if (PSELx PENABLE PWRITE PADDR8h20) // 新增地址0x20写入key_valid key_valid PWDATA[0]; end // 修改mk_isvalid_in置位条件 8h1c: begin key4 PWDATA; mk_isvalid_in (key_valid) ? 1b1 : 1b0; // ← 仅当key_valid1时生效 end6.3 性能压测实测吞吐率与功耗优化建议在Xilinx Artix-7 XC7A35T上实测时钟频率最高125MHz满足SM4 32轮≤400ns要求本文还有配套的精品资源点击获取

关于本文作者

来自尧图内容编辑团队

尧图内容编辑团队 内容团队

尧图内容编辑团队

本文由尧图网络内容编辑团队执笔。团队由资深项目经理、前端工程师与设计师组成,所有内容均来自亲手交付的真实项目,先讲清问题、再给出可落地的解法。尧图深耕北京网站建设十年,服务过京华建材集团、智造科技等各行业客户,把一线经验沉淀为可复用的行业观察。

  • 十年建站经验,覆盖建材、制造、服务、文创等
  • 项目经理把关选题与事实准确性
  • 工程师与设计师联合撰写专业细节
  • 统一编辑规范,保证文风与排版一致
  • 每月复盘转化数据,迭代选题方向

延伸阅读

相关资讯与近期热门内容

深度阅读推荐

建站决策前值得细读的三篇

网站改版的5个关键决策
2024-08-12

网站改版的5个关键决策

什么时候该改版、改到什么程度、如何避免流量掉光,京华建材集团改版复盘给出答案。

获取专属建站方案

看完文章,把您的行业与预算告诉我们,免费获取一份量身定制的官网建设方案与报价。

立即免费咨询